gradle build failed with an exception

 

 

 

 

FAILURE: Build failed with an exception. Where:Build file. /Users/hlship/workspaces/tapestry/tapestry5/tapestry-core/ build.gradle. Now when I build any game for android it gives me: "Gradle build failed.Check the console for details". Tried reinstalling unity, SDK and JDK butorg.gradle.launcher.GradleMain "-Dorg.gradle.jvmargs-Xmx2048m" "assembleRelease" stderr[ FAILURE: Build failed with an exception. FAILURE: Build failed with an exception. Where: Build file /Users/mrhaki/samples/ gradle/continue/build.gradle line: 4 . What went wrong: Execution failed for task :failTask. > Gradle Build failed with an exception: java.exe terminated with non-zero output value 2.Console log: FAILED FAILURE: Build failed with an exception. What went wrong: Execution failed for task :app:dexDebug. com.android.

ide.common.process.ProcessException As per ligis comment.

I have set the buildToolsVersion As 21.1.1 now the build issue have been solved. I just installed Gradle on my Centos 7 CM, both using sdkman and wget as suggested on the Offical Gradle website. I also set GRADLEHOME to the correct directory. However when I run gradle -v --debug I get this: 10:01:03.295 [INFO] [org.gradle .internal.nativeintegration.services.NativeServices] I had been trying to build my test project jar file using gradle instead of ant with uiautomator android but I am getting BUILD FAILED error.which is listed in exception message. I think this is how gradle android plugin works. I am trying to build an opensource project using gradle, but when I run the " gradle clean" command within my local repository directory the following error message appears. FAILURE: Build failed with an exception.Where I keep on getting this eclipseClassPath exception. The Gradle Version, I am using is 3.1 Someone suggested me to use gradle version 2.14 because it wont work with the latest version of gradle. My build.gradle file is below I had the same problem. if you have more than one JRE installed in your machine, copy the tools.jar to more recent JRE1x.xxx version under lib directory. My gradle crashed when I update to more recent gradle and more recent java runtime, and I dont know why java leave the older JRE version folder. C:MinecraftX-RAY-master>gradle build. FAILURE: Build failed with an exception.BUILD FAILED. Total time: 0.715 secs. im not sure, but i think, problem in github token. With --info. BUILD FAILED. Configuration on demand is an incubating feature. FAILURE: Build failed with an exception.Ive got some android programming experience, but I have no idea how to deal with the gradle issues When we run Gradle build with failing tests, then the build will fail36 tests completed, 6 failed, 6 skipped :test FAILED. FAILURE: Build failed with an exception. What went wrong: Execution failed for task :test. > I am trying to build an opensource project using gradle, but when I run the " gradle clean" command within my local repository directory the following error message appears.Run with --info or --debug option to get more log output. BUILD FAILED. FAILURE: Build failed with an exception. What went wrong: Failed to notify build listener. Try: Run with --stacktrace option to get the stack trace. FAILURE: Build failed with an exception.Run with --info or --debug option to get more log output. BUILD FAILED. gradle FAILURE: Build failed with an exception. What went wrong: com/gradle/scan/plugin/internal/a/j/b . Try: Run with --stacktrace option to get the stack trace. Run with --info or --debug option to get more log output. BUILD FAILED.Run android unit tests instrumentation tests on Jenkins (Gradle). FAILURE: Build failed with an exception. What went wrong: Could not determine java version from 9.0.4. Try: Run with stacktrace option to get the stack trace.Posted on February 26, 2018Tags android, gradle, java, unity3d. Dear Concern, I am facing "FAILURE: Build failed with an exception." while building project and task with dependencies. The details message with error is given below: Where: Build file /opt/gradle-1.10/build.gradle FAILURE: Build failed with an exception. Where: Initialization script /tmp/ijinit. gradle line: 16. What went wrong: A problem occurred evaluating initialization script. > org.jetbrains.plugins. gradle.tooling.ModelBuilderService: Provider I keep getting below error when i add new library into gradle: Error:Execution failed for task :app:transformClassesWithDexForDebug. com.android.build.transform.api.TransformException: com.android.ide.common.process.ProcessException: org. gradle.process.internal.ExecException I have configure everything as mention there i can able to build gradle successfully with both way.Android error: Failed to install .apk on device : timeout. How to create a release signed apk file using Gradle? Android Gradle plugin 0.7.0: duplicate files during packaging of APK. I am trying to use jenkins with gradle builds but always I got this errors I have no clue how to solve it on your environment ( bitnami stack). Started by user Jenkins [ Gradle] - Launching build. [xtend-tools] gradle clean test. FAILURE: Build failed with an exception. FAILURE: Build failed with an exception. What went wrong: Execution failed for task :app:clean.Popular Post. ASK: My name is Chaucie Edwards and I was born with a penis and a vagina, whats wrong with me? Run with --info or --debug option to get more log output. BUILD FAILED.and delete the folder named .gradle clear your GM:S build cache (broom icon) and compile an APK again. As for your SDK JDK and NDK questions, jump on over to this thread (post 5) to get up to date. I keep getting FAILURE: Build failed with an exception. What went wrong: A problem was found with the configuration of task :reobf. >Modder Support. ForgeGradle. [Unsolved]Gradle 1.7.2 build failed with an exception. gradle clean build. FAILURE: Build failed with an exception. Where: Build file /Users/mkyong/Documents/workspace/hc2/web/build.gradle line: 25 . What went wrong: A problem occurred evaluating project :web. >(dmxmediapicker) project into the My currently working Library project(Myapplication),which I have used Library for My Android Module(NormalProject) .But after included the Library module, gradle was failed to build and also it showed the The input line is too long exception.anyone please provide a FAILURE: Build failed with an exception. What went wrong: Execution failed for task :app:clean.Related posts. FAILURE: Build failed with an exception. in volleybintray. gradle. Failed to find Build Tools revision 23.0.1. Android Gradle build failed with exception duplicate entry: com/parse/AbstractQueryControllerGradle build fails randomly in Pipelines. 2 mins 24.579 secs gt Building 52 FAILURE: Build failed with an exception. (gradle build finishes SUCCESSFUL. >Executing gradle command: build >MCreator was not able to connect to the internet. Gradle tasks are not going to work. > Microsoft Windows [version 6.1.7601] >Copyright (c) 2009 Microsoft Corporation. Run with debug option to get more log output. BUILD FAILED. Total time: 5.355 secs. Solution. Check your gradle version To run dex in process, the Gradle daemon needs a larger heap. It currently has approximately 910 MB. For faster builds, increase the maximum heap size for the Gradle daemon to more than 2048 MB.FAILURE: Build failed with an exception. What went wrong com.android.build.gradle.BasePlugin10.call(BasePlugin.java:605) at com.android.builder.profile.ThreadRecorder.record/workspace/platforms/android/gradlew: Command failed with exit code 1 Error output: FAILURE: Build failed with an exception. Im trying to use the grails asset-pipeline plugin with the sass extension on Grails 3. Unfortunately, following the documentation to configure them in the build.gradle file isnt useful because this error is generated: FAILURE: Build failed with an exception. I keep getting below error when i add new library into gradle: Error:Execution failed for task :app:transformClassesWithDexForDebug. com.Android.build.transform.api.TransformException: com.Android.ide.common.process.ProcessException: org. gradle.process.internal.ExecException I am trying to import a project to eclipse (which was getting build using intellijide on another computer), but could not succeed using gradle.[Whole Processing 3 ms], Note: Finish processing 19 errors 1 warning :app:compileClientDebugJavaWithJavac FAILED FAILURE: Build failed with an exception. Gradle: FAILURE: Build failed with an exception. What went wrong: Execution failed for task :compileDebugAidl. > No signature of method: com.android.

ide.common.internal.WaitableExecutor.waitForTasks() is applicable for argument types gradle build for c project end with FAILURE: Build failed with an exception I am getting error when Im running this command react-native run-androidFAILURE: Build failed with an exception.Where: BuildRun with --info or --debug option to get more log output. BUILD FAILED. Total time: 16.339 secs. Could not install the app on the device, read the error above for details. Run with --info or --debug option to get more log output. BUILD FAILED.How to create a fragment with a list without ListFragment. Saving an object record using parse. SWIFT - How to use performseguewithidentifier from a tableview in tableviewcell. I am trying to import a project to eclipse (which was getting build using intellijide on another computer), but could not succeed using gradle.Run with --info or --debug option to get more log output. BUILD FAILED. enter image description here. this is my java version "1.7.0141" when i build a gradle app,using gradle bootRun,but there is a Build failed with an exception I hope some one could help me. gradle build for c project end with FAILURE: Build failed with an exception I keep on getting this eclipseClassPath exception. The Gradle Version, I am using is 3.1 Someone suggested me to use gradle version 2.14 because it wont work with the latest version of gradle. My build.gradle file is below: buildscript ext springBootVersion 14:00:31.371 [ERROR] [org.gradle.internal.buildevents.BuildExceptionReporter] FAILURE: Build failed with an exception. Minecraft Mods. Modification Development. FAILURE: Build failed with an exception.Could not resolve all dependencies for configuration :classpath. > Could not resolve net.minecraftforge. gradle:ForgeGradle:1.2-SNAPSHOT. [FIXED] Gradle Sync Failed Error Android Studio 2.3.3 - Продолжительность: 6:19 Phenomenal School 27 518 просмотров.Android Studio problem - stuck at building gradle project info (import project) - Продолжительность: 2:33 Ambar Hasbiyatmoko 37 707 просмотров. I keep on getting this eclipseClassPath exception. The Gradle Version, I am using is 3.1 Someone suggested me to use gradle version 2.14 because it wont work with the latest version of gradle. My build.gradle file is below

related notes


Copyright ©